{"text_format":"1","workbook":"xlsx","n_sheets":3,"sheets":["Image Log","300ppi Resolution Calc","Import Style Sheet"],"not_rendered":{"charts":0,"images":0,"macros":0,"external_links":0,"defined_names":1,"comments":0,"pivot_tables":0},"unopened":[],"bounds":{"document_bytes":16777216,"sheet_cells":100000,"rows_first":2000,"rows_last":500,"rows_between":2000,"halvings":0,"cell_chars":16384,"cell_head_chars":4096},"cells_cut":0,"cells_raw":0,"read":"whole","date_system":"1900"}

{"sheet":"Image Log","index":0,"n_rows":1001,"n_cols":14,"rows_kept":1001,"cut":false,"hidden":false,"merged":[[0,12,0,13],[0,0,0,7]]}
["List of Desired Images",null,null,null,null,null,null,null,"Image Review",null,null,null,"Image Resolution Check\n(300 PPI - Effective Size)"]
["Ch. #","Fig. #","Image Title","Source Title (Book/Journal/URL)","Year","Author","Page #","Author Notes/Questions/Special Requests","Clearing Method","Licensing Notes","Production Notes","Creditlines","Width (inches)","Height (inches)"]
[1,"Fig. 1.1","Basketry-covered Glass Bottle","http://commons.wikimedia.org/wiki/File:Basketry-covered_lightbulb_01.jpg",2001,"Joe Mabel","~1","Please crop image to only show left-side basket.","Creative Commons License","(CC BY 3.0)",null,{"$f":"IF(AND(I3=\"Creative Commons License\",OR(J3=\"(CC BY 4.0)\",J3=\"CC BY 4.0\")),CONCATENATE(B3,\": \",\"Copyright © \",E3,\" by \",F3,\", (CC BY 4.0)\",\" at \",D3,\".\"),\nIF(AND(I3=\"Creative Commons License\",OR(J3=\"(CC BY 3.0)\",J3=\"CC BY 3.0\")),CONCATENATE(B3,\": \",\"Copyright © \",E3,\" by \",F3,\", (CC BY 3.0)\",\" at \",D3,\".\"),\nIF(AND(I3=\"Creative Commons License\",OR(J3=\"(CC BY 2.5)\",J3=\"CC BY 2.5\")),CONCATENATE(B3,\": \",\"Copyright © \",E3,\" by \",F3,\", (CC BY 2.5)\",\" at \",D3,\".\"),\nIF(AND(I3=\"Creative Commons License\",OR(J3=\"(CC BY 2.0)\",J3=\"CC BY 2.0\")),CONCATENATE(B3,\": \",\"Copyright © \",E3,\" by \",F3,\", (CC BY 2.0)\",\" at \",D3,\".\"),\nIF(AND(I3=\"Creative Commons License\",OR(J3=\"(CC BY 1.0)\",J3=\"CC BY 1.0\")),CONCATENATE(B3,\": \",\"Copyright © \",E3,\" by \",F3,\", (CC BY 1.0)\",\" at \",D3,\".\"),\nIF(AND(I3=\"Creative Commons License\",OR(J3=\"(CC BY-SA 4.0)\",J3=\"CC BY-SA 4.0\")),CONCATENATE(B3,\": \",\"Copyright © \",E3,\" by \",F3,\", (CC BY-SA 4.0)\",\" at \",D3,\".\"),\nIF(AND(I3=\"Creative Commons License\",OR(J3=\"(CC BY-SA 3.0)\",J3=\"CC BY-SA 3.0\")),CONCATENATE(B3,\": \",\"Copyright © \",E3,\" by \",F3,\", (CC BY-SA 3.0)\",\" at \",D3,\".\"),\nIF(AND(I3=\"Creative Commons License\",OR(J3=\"(CC BY-SA 2.5)\",J3=\"CC BY-SA 2.5\")),CONCATENATE(B3,\": \",\"Copyright © \",E3,\" by \",F3,\", (CC BY-SA 2.5)\",\" at \",D3,\".\"),\nIF(AND(I3=\"Creative Commons License\",OR(J3=\"(CC BY-SA 2.0)\",J3=\"CC BY-SA 2.0\")),CONCATENATE(B3,\": \",\"Copyright © \",E3,\" by \",F3,\", (CC BY-SA 2.0)\",\" at \",D3,\".\"),\nIF(AND(I3=\"Creative Commons License\",OR(J3=\"(CC BY-SA 1.0)\",J3=\"CC BY-SA 1.0\")),CONCATENATE(B3,\": \",\"Copyright © \",E3,\" by \",F3,\", (CC BY-SA 1.0)\",\" at \",D3,\".\"),\nIF(AND(I3=\"Creative Commons License\",OR(J3=\"(FAL 1.3)\",J3=\"FAL 1.3\")),CONCATENATE(B3,\": \",\"Copyright © \",E3,\" by \",F3,\", (FAL 1.3)\",\" at \",D3,\".\",\" A copy of the full license can be found here: http://artlibre.org/licence/lal/en.\"),\nIF(I3=\"Public Domain\",CONCATENATE(B3,\": \",F3,\" / \",\"Copyright in the Public Domain\",\".\"),\nIF(I3=\"Fair Use\",CONCATENATE(B3,\": \",\"Copyright © \",E3,\" by \",F3,\".\"),\nIF(I3=\"Request to Rights Holder\",CONCATENATE(B3,\": \",\"Copyright © \",E3,\" by \",F3,\".\",\" Reprinted with permission.\"),\"\"))))))))))))))","v":"Fig. 1.1: Copyright © 2001 by Joe Mabel, (CC BY 3.0) at http://commons.wikimedia.org/wiki/File:Basketry-covered_lightbulb_01.jpg."},null,"Map \n(any map less than 4x4)"]
[1,"Fig. 1.2","Water Pollution","Environmental Science: Earth as a Living Planet",1996,"Edward Lacy",73,null,"Request to Rights Holder","3/13/15 BF: Replace or Cut.","2/14/15 CY: Replaced with:",{"$f":"IF(AND(I4=\"Creative Commons License\",OR(J4=\"(CC BY 4.0)\",J4=\"CC BY 4.0\")),CONCATENATE(B4,\": \",\"Copyright © \",E4,\" by \",F4,\", (CC BY 4.0)\",\" at \",D4,\".\"),\nIF(AND(I4=\"Creative Commons License\",OR(J4=\"(CC BY 3.0)\",J4=\"CC BY 3.0\")),CONCATENATE(B4,\": \",\"Copyright © \",E4,\" by \",F4,\", (CC BY 3.0)\",\" at \",D4,\".\"),\nIF(AND(I4=\"Creative Commons License\",OR(J4=\"(CC BY 2.5)\",J4=\"CC BY 2.5\")),CONCATENATE(B4,\": \",\"Copyright © \",E4,\" by \",F4,\", (CC BY 2.5)\",\" at \",D4,\".\"),\nIF(AND(I4=\"Creative Commons License\",OR(J4=\"(CC BY 2.0)\",J4=\"CC BY 2.0\")),CONCATENATE(B4,\": \",\"Copyright © \",E4,\" by \",F4,\", (CC BY 2.0)\",\" at \",D4,\".\"),\nIF(AND(I4=\"Creative Commons License\",OR(J4=\"(CC BY 1.0)\",J4=\"CC BY 1.0\")),CONCATENATE(B4,\": \",\"Copyright © \",E4,\" by \",F4,\", (CC BY 1.0)\",\" at \",D4,\".\"),\nIF(AND(I4=\"Creative Commons License\",OR(J4=\"(CC BY-SA 4.0)\",J4=\"CC BY-SA 4.0\")),CONCATENATE(B4,\": \",\"Copyright © \",E4,\" by \",F4,\", (CC BY-SA 4.0)\",\" at \",D4,\".\"),\nIF(AND(I4=\"Creative Commons License\",OR(J4=\"(CC BY-SA 3.0)\",J4=\"CC BY-SA 3.0\")),CONCATENATE(B4,\": \",\"Copyright © \",E4,\" by \",F4,\", (CC BY-SA 3.0)\",\" at \",D4,\".\"),\nIF(AND(I4=\"Creative Commons License\",OR(J4=\"(CC BY-SA 2.5)\",J4=\"CC BY-SA 2.5\")),CONCATENATE(B4,\": \",\"Copyright © \",E4,\" by \",F4,\", (CC BY-SA 2.5)\",\" at \",D4,\".\"),\nIF(AND(I4=\"Creative Commons License\",OR(J4=\"(CC BY-SA 2.0)\",J4=\"CC BY-SA 2.0\")),CONCATENATE(B4,\": \",\"Copyright © \",E4,\" by \",F4,\", (CC BY-SA 2.0)\",\" at \",D4,\".\"),\nIF(AND(I4=\"Creative Commons License\",OR(J4=\"(CC BY-SA 1.0)\",J4=\"CC BY-SA 1.0\")),CONCATENATE(B4,\": \",\"Copyright © \",E4,\" by \",F4,\", (CC BY-SA 1.0)\",\" at \",D4,\".\"),\nIF(AND(I4=\"Creative Commons License\",OR(J4=\"(FAL 1.3)\",J4=\"FAL 1.3\")),CONCATENATE(B4,\": \",\"Copyright © \",E4,\" by \",F4,\", (FAL 1.3)\",\" at \",D4,\".\",\" A copy of the full license can be found here: http://artlibre.org/licence/lal/en.\"),\nIF(I4=\"Public Domain\",CONCATENATE(B4,\": \",F4,\" / \",\"Copyright in the Public Domain\",\".\"),\nIF(I4=\"Fair Use\",CONCATENATE(B4,\": \",\"Copyright © \",E4,\" by \",F4,\".\"),\nIF(I4=\"Request to Rights Holder\",CONCATENATE(B4,\": \",\"Copyright © \",E4,\" by \",F4,\".\",\" Reprinted with permission.\"),\"\"))))))))))))))","v":"Fig. 1.2: Copyright © 1996 by Edward Lacy. Reprinted with permission."},null,"Small \n(less than 4x4)"]
[2,"Fig. 2.1","Basketball Team","Original (photo taken by author)",2012,"Jared Abbredaris","~1",null,"Editor/Author's Own Content",null,null,{"$f":"IF(AND(I5=\"Creative Commons License\",OR(J5=\"(CC BY 4.0)\",J5=\"CC BY 4.0\")),CONCATENATE(B5,\": \",\"Copyright © \",E5,\" by \",F5,\", (CC BY 4.0)\",\" at \",D5,\".\"),\nIF(AND(I5=\"Creative Commons License\",OR(J5=\"(CC BY 3.0)\",J5=\"CC BY 3.0\")),CONCATENATE(B5,\": \",\"Copyright © \",E5,\" by \",F5,\", (CC BY 3.0)\",\" at \",D5,\".\"),\nIF(AND(I5=\"Creative Commons License\",OR(J5=\"(CC BY 2.5)\",J5=\"CC BY 2.5\")),CONCATENATE(B5,\": \",\"Copyright © \",E5,\" by \",F5,\", (CC BY 2.5)\",\" at \",D5,\".\"),\nIF(AND(I5=\"Creative Commons License\",OR(J5=\"(CC BY 2.0)\",J5=\"CC BY 2.0\")),CONCATENATE(B5,\": \",\"Copyright © \",E5,\" by \",F5,\", (CC BY 2.0)\",\" at \",D5,\".\"),\nIF(AND(I5=\"Creative Commons License\",OR(J5=\"(CC BY 1.0)\",J5=\"CC BY 1.0\")),CONCATENATE(B5,\": \",\"Copyright © \",E5,\" by \",F5,\", (CC BY 1.0)\",\" at \",D5,\".\"),\nIF(AND(I5=\"Creative Commons License\",OR(J5=\"(CC BY-SA 4.0)\",J5=\"CC BY-SA 4.0\")),CONCATENATE(B5,\": \",\"Copyright © \",E5,\" by \",F5,\", (CC BY-SA 4.0)\",\" at \",D5,\".\"),\nIF(AND(I5=\"Creative Commons License\",OR(J5=\"(CC BY-SA 3.0)\",J5=\"CC BY-SA 3.0\")),CONCATENATE(B5,\": \",\"Copyright © \",E5,\" by \",F5,\", (CC BY-SA 3.0)\",\" at \",D5,\".\"),\nIF(AND(I5=\"Creative Commons License\",OR(J5=\"(CC BY-SA 2.5)\",J5=\"CC BY-SA 2.5\")),CONCATENATE(B5,\": \",\"Copyright © \",E5,\" by \",F5,\", (CC BY-SA 2.5)\",\" at \",D5,\".\"),\nIF(AND(I5=\"Creative Commons License\",OR(J5=\"(CC BY-SA 2.0)\",J5=\"CC BY-SA 2.0\")),CONCATENATE(B5,\": \",\"Copyright © \",E5,\" by \",F5,\", (CC BY-SA 2.0)\",\" at \",D5,\".\"),\nIF(AND(I5=\"Creative Commons License\",OR(J5=\"(CC BY-SA 1.0)\",J5=\"CC BY-SA 1.0\")),CONCATENATE(B5,\": \",\"Copyright © \",E5,\" by \",F5,\", (CC BY-SA 1.0)\",\" at \",D5,\".\"),\nIF(AND(I5=\"Creative Commons License\",OR(J5=\"(FAL 1.3)\",J5=\"FAL 1.3\")),CONCATENATE(B5,\": \",\"Copyright © \",E5,\" by \",F5,\", (FAL 1.3)\",\" at \",D5,\".\",\" A copy of the full license can be found here: http://artlibre.org/licence/lal/en.\"),\nIF(I5=\"Public Domain\",CONCATENATE(B5,\": \",F5,\" / \",\"Copyright in the Public Domain\",\".\"),\nIF(I5=\"Fair Use\",CONCATENATE(B5,\": \",\"Copyright © \",E5,\" by \",F5,\".\"),\nIF(I5=\"Request to Rights Holder\",CONCATENATE(B5,\": \",\"Copyright © \",E5,\" by \",F5,\".\",\" Reprinted with permission.\"),\"\"))))))))))))))","v":""},null,"Low Res \n(less than or equal to 2x2)"]
[null,null,null,null,null,null,null,null,null,null,null,{"$f":"IF(AND(I6=\"Creative Commons License\",OR(J6=\"(CC BY 4.0)\",J6=\"CC BY 4.0\")),CONCATENATE(B6,\": \",\"Copyright © \",E6,\" by \",F6,\", (CC BY 4.0)\",\" at \",D6,\".\"),\nIF(AND(I6=\"Creative Commons License\",OR(J6=\"(CC BY 3.0)\",J6=\"CC BY 3.0\")),CONCATENATE(B6,\": \",\"Copyright © \",E6,\" by \",F6,\", (CC BY 3.0)\",\" at \",D6,\".\"),\nIF(AND(I6=\"Creative Commons License\",OR(J6=\"(CC BY 2.5)\",J6=\"CC BY 2.5\")),CONCATENATE(B6,\": \",\"Copyright © \",E6,\" by \",F6,\", (CC BY 2.5)\",\" at \",D6,\".\"),\nIF(AND(I6=\"Creative Commons License\",OR(J6=\"(CC BY 2.0)\",J6=\"CC BY 2.0\")),CONCATENATE(B6,\": \",\"Copyright © \",E6,\" by \",F6,\", (CC BY 2.0)\",\" at \",D6,\".\"),\nIF(AND(I6=\"Creative Commons License\",OR(J6=\"(CC BY 1.0)\",J6=\"CC BY 1.0\")),CONCATENATE(B6,\": \",\"Copyright © \",E6,\" by \",F6,\", (CC BY 1.0)\",\" at \",D6,\".\"),\nIF(AND(I6=\"Creative Commons License\",OR(J6=\"(CC BY-SA 4.0)\",J6=\"CC BY-SA 4.0\")),CONCATENATE(B6,\": \",\"Copyright © \",E6,\" by \",F6,\", (CC BY-SA 4.0)\",\" at \",D6,\".\"),\nIF(AND(I6=\"Creative Commons License\",OR(J6=\"(CC BY-SA 3.0)\",J6=\"CC BY-SA 3.0\")),CONCATENATE(B6,\": \",\"Copyright © \",E6,\" by \",F6,\", (CC BY-SA 3.0)\",\" at \",D6,\".\"),\nIF(AND(I6=\"Creative Commons License\",OR(J6=\"(CC BY-SA 2.5)\",J6=\"CC BY-SA 2.5\")),CONCATENATE(B6,\": \",\"Copyright © \",E6,\" by \",F6,\", (CC BY-SA 2.5)\",\" at \",D6,\".\"),\nIF(AND(I6=\"Creative Commons License\",OR(J6=\"(CC BY-SA 2.0)\",J6=\"CC BY-SA 2.0\")),CONCATENATE(B6,\": \",\"Copyright © \",E6,\" by \",F6,\", (CC BY-SA 2.0)\",\" at \",D6,\".\"),\nIF(AND(I6=\"Creative Commons License\",OR(J6=\"(CC BY-SA 1.0)\",J6=\"CC BY-SA 1.0\")),CONCATENATE(B6,\": \",\"Copyright © \",E6,\" by \",F6,\", (CC BY-SA 1.0)\",\" at \",D6,\".\"),\nIF(AND(I6=\"Creative Commons License\",OR(J6=\"(FAL 1.3)\",J6=\"FAL 1.3\")),CONCATENATE(B6,\": \",\"Copyright © \",E6,\" by \",F6,\", (FAL 1.3)\",\" at \",D6,\".\",\" A copy of the full license can be found here: http://artlibre.org/licence/lal/en.\"),\nIF(I6=\"Public Domain\",CONCATENATE(B6,\": \",F6,\" / \",\"Copyright in the Public Domain\",\".\"),\nIF(I6=\"Fair Use\",CONCATENATE(B6,\": \",\"Copyright © \",E6,\" by \",F6,\".\"),\nIF(I6=\"Request to Rights Holder\",CONCATENATE(B6,\": \",\"Copyright © \",E6,\" by \",F6,\".\",\" Reprinted with permission.\"),\"\"))))))))))))))","v":""}]
[null,null,null,null,null,null,null,null,null,null,null,{"$f":"IF(AND(I7=\"Creative Commons License\",ISNUMBER(SEARCH(\"(\",J7))),CONCATENATE(B7,\": \",\"Copyright © by \",F7,\" \",J7,\" at \",D7,\".\"),\nIF(AND(I7=\"Creative Commons License\",NOT(ISNUMBER(SEARCH(\"(\",J7)))),CONCATENATE(B7,\": \",\"Copyright © by \",F7,\" (\",J7,\") at \",D7,\".\"),\nIF(I7=\"Public Domain\",CONCATENATE(B7,\": Source: \",D7,\".\"),\nIF(AND(I7=\"Fair Use\",OR(ISNUMBER(SEARCH(\"discuss\",J7)),ISNUMBER(SEARCH(\"critique\",J7)))),CONCATENATE(B7,\": \",\"Copyright © by \",F7,\".\"),\nIF(AND(I7=\"Fair Use\",NOT(OR(ISNUMBER(SEARCH(\"discuss\",J7)),ISNUMBER(SEARCH(\"critique\",J7))))),CONCATENATE(B7,\": Source: \",D7,\".\"),\nIF(AND(I7=\"Request to Rights Holder\",ISBLANK(E7),NOT(ISNUMBER(SEARCH(\"depositphotos\",D7))),NOT(ISNUMBER(SEARCH(\"FAL \",J7))),NOT(ISNUMBER(SEARCH(\"GNU \",J7)))),CONCATENATE(B7,\": \",\"Copyright ©\",\" by \",F7,\".\",\" Reprinted with permission.\"),\nIF(AND(I7=\"Request to Rights Holder\",NOT(ISBLANK(E7)),NOT(ISNUMBER(SEARCH(\"depositphotos\",D7))),NOT(ISNUMBER(SEARCH(\"FAL \",J7))),NOT(ISNUMBER(SEARCH(\"GNU \",J7)))),CONCATENATE(B7,\": \",\"Copyright © \",E7,\" by \",F7,\".\",\" Reprinted with permission.\"),\nIF(AND(I7=\"Request to Rights Holder\",NOT(ISBLANK(E7)),ISNUMBER(SEARCH(\"depositphotos\",D7))),CONCATENATE(B7,\":\",\" Copyright © \",E7,\" Depositphotos\",\"/\",F7,\".\"),\nIF(AND(I7=\"Request to Rights Holder\",ISBLANK(E7),ISNUMBER(SEARCH(\"depositphotos\",D7))),CONCATENATE(B7,\":\",\" Copyright © \",E7,\"Depositphotos\",\"/\",F7,\".\"),\nIF(AND(I7=\"Request to Rights Holder\",ISNUMBER(SEARCH(\"FAL \",J7)),ISNUMBER(SEARCH(\"(\",J7))),CONCATENATE(B7,\": \",\"Copyright © by \",F7,\" \",J7,\" at \",D7,\". A copy of the license can be found here: http://artlibre.org/licence/lal/en.\"),\nIF(AND(I7=\"Request to Rights Holder\",ISNUMBER(SEARCH(\"FAL \",J7)),NOT(ISNUMBER(SEARCH(\"(\",J7)))),CONCATENATE(B7,\": \",\"Copyright © by \",F7,\" (\",J7,\") at \",D7,\". A copy of the license can be found here: http://artlibre.org/licence/lal/en.\"),\nIF(AND(I7=\"Request to Rights Holder\",ISNUMBER(SEARCH(\"GNU \",J7)),ISNUMBER(SEARCH(\"(\",J7))),CONCATENATE(B7,\": \",\"Copyright © by \",F7,\" \",J7,\" at \",D7,\". A copy of the license can be found here: http://www.gnu.org/licenses/gpl.html\"),\nIF(AND(I7=\"Request to Rights Holder\",ISNUMBER(SEARCH(\"GNU \",J7)),NOT(ISNUMBER(SEARCH(\"(\",J7)))),CONCATENATE(B7,\": \",\"Copyright © by \",F7,\" (\",J7,\") at \",D7,\". A copy of the license can be found here: http://www.gnu.org/licenses/gpl.html\"),\n\"\")))))))))))))","v":""},{"$f":"IF(ISERROR(VLOOKUP($B7,'300ppi Resolution Calc'!$A$2:$E$1001,4,0)),\"\",VLOOKUP($B7,'300ppi Resolution Calc'!$A$2:$E$1001,4,0))","v":""},{"$f":"IF(ISERROR(VLOOKUP($B7,'300ppi Resolution Calc'!$A$2:$E$1001,5,0)),\"\",VLOOKUP($B7,'300ppi Resolution Calc'!$A$2:$E$1001,5,0))","v":""}]
[null,null,null,null,null,null,null,null,null,null,null,{"$f":"IF(AND(I8=\"Creative Commons License\",ISNUMBER(SEARCH(\"(\",J8))),CONCATENATE(B8,\": \",\"Copyright © by \",F8,\" \",J8,\" at \",D8,\".\"),\nIF(AND(I8=\"Creative Commons License\",NOT(ISNUMBER(SEARCH(\"(\",J8)))),CONCATENATE(B8,\": \",\"Copyright © by \",F8,\" (\",J8,\") at \",D8,\".\"),\nIF(I8=\"Public Domain\",CONCATENATE(B8,\": Source: \",D8,\".\"),\nIF(AND(I8=\"Fair Use\",OR(ISNUMBER(SEARCH(\"discuss\",J8)),ISNUMBER(SEARCH(\"critique\",J8)))),CONCATENATE(B8,\": \",\"Copyright © by \",F8,\".\"),\nIF(AND(I8=\"Fair Use\",NOT(OR(ISNUMBER(SEARCH(\"discuss\",J8)),ISNUMBER(SEARCH(\"critique\",J8))))),CONCATENATE(B8,\": Source: \",D8,\".\"),\nIF(AND(I8=\"Request to Rights Holder\",ISBLANK(E8),NOT(ISNUMBER(SEARCH(\"depositphotos\",D8))),NOT(ISNUMBER(SEARCH(\"FAL \",J8))),NOT(ISNUMBER(SEARCH(\"GNU \",J8)))),CONCATENATE(B8,\": \",\"Copyright ©\",\" by \",F8,\".\",\" Reprinted with permission.\"),\nIF(AND(I8=\"Request to Rights Holder\",NOT(ISBLANK(E8)),NOT(ISNUMBER(SEARCH(\"depositphotos\",D8))),NOT(ISNUMBER(SEARCH(\"FAL \",J8))),NOT(ISNUMBER(SEARCH(\"GNU \",J8)))),CONCATENATE(B8,\": \",\"Copyright © \",E8,\" by \",F8,\".\",\" Reprinted with permission.\"),\nIF(AND(I8=\"Request to Rights Holder\",NOT(ISBLANK(E8)),ISNUMBER(SEARCH(\"depositphotos\",D8))),CONCATENATE(B8,\":\",\" Copyright © \",E8,\" Depositphotos\",\"/\",F8,\".\"),\nIF(AND(I8=\"Request to Rights Holder\",ISBLANK(E8),ISNUMBER(SEARCH(\"depositphotos\",D8))),CONCATENATE(B8,\":\",\" Copyright © \",E8,\"Depositphotos\",\"/\",F8,\".\"),\nIF(AND(I8=\"Request to Rights Holder\",ISNUMBER(SEARCH(\"FAL \",J8)),ISNUMBER(SEARCH(\"(\",J8))),CONCATENATE(B8,\": \",\"Copyright © by \",F8,\" \",J8,\" at \",D8,\". A copy of the license can be found here: http://artlibre.org/licence/lal/en.\"),\nIF(AND(I8=\"Request to Rights Holder\",ISNUMBER(SEARCH(\"FAL \",J8)),NOT(ISNUMBER(SEARCH(\"(\",J8)))),CONCATENATE(B8,\": \",\"Copyright © by \",F8,\" (\",J8,\") at \",D8,\". A copy of the license can be found here: http://artlibre.org/licence/lal/en.\"),\nIF(AND(I8=\"Request to Rights Holder\",ISNUMBER(SEARCH(\"GNU \",J8)),ISNUMBER(SEARCH(\"(\",J8))),CONCATENATE(B8,\": \",\"Copyright © by \",F8,\" \",J8,\" at \",D8,\". A copy of the license can be found here: http://www.gnu.org/licenses/gpl.html\"),\nIF(AND(I8=\"Request to Rights Holder\",ISNUMBER(SEARCH(\"GNU \",J8)),NOT(ISNUMBER(SEARCH(\"(\",J8)))),CONCATENATE(B8,\": \",\"Copyright © by \",F8,\" (\",J8,\") at \",D8,\". A copy of the license can be found here: http://www.gnu.org/licenses/gpl.html\"),\n\"\")))))))))))))","v":""},{"$f":"IF(ISERROR(VLOOKUP($B8,'300ppi Resolution Calc'!$A$2:$E$1001,4,0)),\"\",VLOOKUP($B8,'300ppi Resolution Calc'!$A$2:$E$1001,4,0))","v":""},{"$f":"IF(ISERROR(VLOOKUP($B8,'300ppi Resolution Calc'!$A$2:$E$1001,5,0)),\"\",VLOOKUP($B8,'300ppi Resolution Calc'!$A$2:$E$1001,5,0))","v":""}]
[null,null,null,null,null,null,null,null,null,null,null,"",{"$f":"IF(ISERROR(VLOOKUP($B9,'300ppi Resolution Calc'!$A$2:$E$1001,4,0)),\"\",VLOOKUP($B9,'300ppi Resolution Calc'!$A$2:$E$1001,4,0))","v":""},{"$f":"IF(ISERROR(VLOOKUP($B9,'300ppi Resolution Calc'!$A$2:$E$1001,5,0)),\"\",VLOOKUP($B9,'300ppi Resolution Calc'!$A$2:$E$1001,5,0))","v":""}]
[null,null,null,null,null,null,null,null,null,null,null,"",{"$f":"IF(ISERROR(VLOOKUP($B10,'300ppi Resolution Calc'!$A$2:$E$1001,4,0)),\"\",VLOOKUP($B10,'300ppi Resolution Calc'!$A$2:$E$1001,4,0))","v":""},{"$f":"IF(ISERROR(VLOOKUP($B10,'300ppi Resolution Calc'!$A$2:$E$1001,5,0)),\"\",VLOOKUP($B10,'300ppi Resolution Calc'!$A$2:$E$1001,5,0))","v":""}]
[null,null,null,null,null,null,null,null,null,null,null,"",{"$f":"IF(ISERROR(VLOOKUP($B11,'300ppi Resolution Calc'!$A$2:$E$1001,4,0)),\"\",VLOOKUP($B11,'300ppi Resolution Calc'!$A$2:$E$1001,4,0))","v":""},{"$f":"IF(ISERROR(VLOOKUP($B11,'300ppi Resolution Calc'!$A$2:$E$1001,5,0)),\"\",VLOOKUP($B11,'300ppi Resolution Calc'!$A$2:$E$1001,5,0))","v":""}]
[null,null,null,null,null,null,null,null,null,null,null,"",{"$f":"IF(ISERROR(VLOOKUP($B12,'300ppi Resolution Calc'!$A$2:$E$1001,4,0)),\"\",VLOOKUP($B12,'300ppi Resolution Calc'!$A$2:$E$1001,4,0))","v":""},{"$f":"IF(ISERROR(VLOOKUP($B12,'300ppi Resolution Calc'!$A$2:$E$1001,5,0)),\"\",VLOOKUP($B12,'300ppi Resolution Calc'!$A$2:$E$1001,5,0))","v":""}]
[null,null,null,null,null,null,null,null,null,null,null,"",{"$f":"IF(ISERROR(VLOOKUP($B13,'300ppi Resolution Calc'!$A$2:$E$1001,4,0)),\"\",VLOOKUP($B13,'300ppi Resolution Calc'!$A$2:$E$1001,4,0))","v":""},{"$f":"IF(ISERROR(VLOOKUP($B13,'300ppi Resolution Calc'!$A$2:$E$1001,5,0)),\"\",VLOOKUP($B13,'300ppi Resolution Calc'!$A$2:$E$1001,5,0))","v":""}]
[null,null,null,null,null,null,null,null,null,null,null,"",{"$f":"IF(ISERROR(VLOOKUP($B14,'300ppi Resolution Calc'!$A$2:$E$1001,4,0)),\"\",VLOOKUP($B14,'300ppi Resolution Calc'!$A$2:$E$1001,4,0))","v":""},{"$f":"IF(ISERROR(VLOOKUP($B14,'300ppi Resolution Calc'!$A$2:$E$1001,5,0)),\"\",VLOOKUP($B14,'300ppi Resolution Calc'!$A$2:$E$1001,5,0))","v":""}]
[null,null,null,null,null,null,null,null,null,null,null,"",{"$f":"IF(ISERROR(VLOOKUP($B15,'300ppi Resolution Calc'!$A$2:$E$1001,4,0)),\"\",VLOOKUP($B15,'300ppi Resolution Calc'!$A$2:$E$1001,4,0))","v":""},{"$f":"IF(ISERROR(VLOOKUP($B15,'300ppi Resolution Calc'!$A$2:$E$1001,5,0)),\"\",VLOOKUP($B15,'300ppi Resolution Calc'!$A$2:$E$1001,5,0))","v":""}]
[null,null,null,null,null,null,null,null,null,null,null,"",{"$f":"IF(ISERROR(VLOOKUP($B16,'300ppi Resolution Calc'!$A$2:$E$1001,4,0)),\"\",VLOOKUP($B16,'300ppi Resolution Calc'!$A$2:$E$1001,4,0))","v":""},{"$f":"IF(ISERROR(VLOOKUP($B16,'300ppi Resolution Calc'!$A$2:$E$1001,5,0)),\"\",VLOOKUP($B16,'300ppi Resolution Calc'!$A$2:$E$1001,5,0))","v":""}]
[null,null,null,null,null,null,null,null,null,null,null,"",{"$f":"IF(ISERROR(VLOOKUP($B17,'300ppi Resolution Calc'!$A$2:$E$1001,4,0)),\"\",VLOOKUP($B17,'300ppi Resolution Calc'!$A$2:$E$1001,4,0))","v":""},{"$f":"IF(ISERROR(VLOOKUP($B17,'300ppi Resolution Calc'!$A$2:$E$1001,5,0)),\"\",VLOOKUP($B17,'300ppi Resolution Calc'!$A$2:$E$1001,5,0))","v":""}]
[null,null,null,null,null,null,null,null,null,null,null,"",{"$f":"IF(ISERROR(VLOOKUP($B18,'300ppi Resolution Calc'!$A$2:$E$1001,4,0)),\"\",VLOOKUP($B18,'300ppi Resolution Calc'!$A$2:$E$1001,4,0))","v":""},{"$f":"IF(ISERROR(VLOOKUP($B18,'300ppi Resolution Calc'!$A$2:$E$1001,5,0)),\"\",VLOOKUP($B18,'300ppi Resolution Calc'!$A$2:$E$1001,5,0))","v":""}]
[null,null,null,null,null,null,null,null,null,null,null,"",{"$f":"IF(ISERROR(VLOOKUP($B19,'300ppi Resolution Calc'!$A$2:$E$1001,4,0)),\"\",VLOOKUP($B19,'300ppi Resolution Calc'!$A$2:$E$1001,4,0))","v":""},{"$f":"IF(ISERROR(VLOOKUP($B19,'300ppi Resolution Calc'!$A$2:$E$1001,5,0)),\"\",VLOOKUP($B19,'300ppi Resolution Calc'!$A$2:$E$1001,5,0))","v":""}]
[null,null,null,null,null,null,null,null,null,null,null,"",{"$f":"IF(ISERROR(VLOOKUP($B20,'300ppi Resolution Calc'!$A$2:$E$1001,4,0)),\"\",VLOOKUP($B20,'300ppi Resolution Calc'!$A$2:$E$1001,4,0))","v":""},{"$f":"IF(ISERROR(VLOOKUP($B20,'300ppi Resolution Calc'!$A$2:$E$1001,5,0)),\"\",VLOOKUP($B20,'300ppi Resolution Calc'!$A$2:$E$1001,5,0))","v":""}]
{"$rows_left_out":982}
{"sheet":"300ppi Resolution Calc","index":1,"n_rows":1001,"n_cols":5,"rows_kept":1001,"cut":false,"hidden":true,"merged":[]}
["Figure Number","Width - Pixels","Height - Pixels","Width Inches - 300 ppi","Height Inches - 300 ppi"]
["Fig. B.1",1000,1600,{"$f":"ROUND(B2/300,2)","v":3.33},{"$f":"ROUND(C2/300,2)","v":5.33}]
["Fig. A.1",300,200,{"$f":"ROUND(B3/300,2)","v":1},{"$f":"ROUND(C3/300,2)","v":0.67}]
["Fig. A.2",1600,1000,5.33,3.33]
[null,null,null,{"$f":"ROUND(B5/300,2)","v":0},{"$f":"ROUND(C5/300,2)","v":0}]
[null,null,null,{"$f":"ROUND(B6/300,2)","v":0},{"$f":"ROUND(C6/300,2)","v":0}]
[null,null,null,0,0]
[null,null,null,0,0]
[null,null,null,0,0]
[null,null,null,0,0]
[null,null,null,0,0]
[null,null,null,0,0]
[null,null,null,0,0]
[null,null,null,0,0]
[null,null,null,0,0]
[null,null,null,0,0]
[null,null,null,0,0]
[null,null,null,0,0]
[null,null,null,0,0]
[null,null,null,0,0]
{"$rows_left_out":982}
{"sheet":"Import Style Sheet","index":2,"n_rows":2,"n_cols":76,"rows_kept":2,"cut":false,"hidden":true,"merged":[]}
["Sequence","Chapter ID","License Status","Clearing Method","Content Item Type","Content Piece Type","Selection Title","Diff. RH?","Anthologized Source","RH Publication Title","RH URL","RH Pub Edition","RH Author","RH Page Range","RH © Year","CCC","RH ISBN/ISSN","S-Num","Reading Source Type","Reading Layout","Partner?","Publisher DRM","E-Rights","Free DL","DRM","Initial Req","First FU","Second FU","Third FU","Follow Up On","Cleared On","Denied On","Active Pricing","Price!","Est. Pricing Type","PC","Flat","Flat Per Page","Flat Per Copy","PP+PC","Est. Total License Fee","Est. Cost PC","Est. Cost PPPC","Est. Fee Details","Agreement #","Agreement Total Amount","Agr. Cost PC","Agr. Cost PPPC","Max Copies","Territories Granted","Formats Granted","Expires","Edition Restrictions","Revision Restriction Details","Req. Copy of Textbook","Copy of Textbook Sent On","Negotiation Notes","Paid On","Payment Details","ODID","Attribution","Publication Title","URL","Pub Edition","Author/Editor","© Year","© Month","© Day","© Season","Page Range","ISBN/ISSN","Content ID","Reading Notes","Production Notes","Number of Relations","Lic Notes"]
[null,{"$f":"IF((ISBLANK('Image Log'!B7)), \"\",'Image Log'!B7)","v":""},"Unsent/Needs Request",{"$f":"'Image Log'!I7","v":0},null,"Image",{"$f":"IF((ISBLANK('Image Log'!C7)), \"\",'Image Log'!C7)","v":""},null,null,{"$f":"IF((ISBLANK('Image Log'!D7)), \"\",'Image Log'!D7)","v":""},{"$f":"IF((ISBLANK('Image Log'!D7)), \"\",'Image Log'!D7)","v":""},null,{"$f":"IF(ISBLANK('Image Log'!F7), \"\",'Image Log'!F7)","v":""},{"$f":"IF(ISBLANK('Image Log'!G7), \"\",'Image Log'!G7)","v":""},{"$f":"IF(ISBLANK('Image Log'!E7), \"\",'Image Log'!E7)","v":""},null,null,null,null,null,null,null,"1",null,null,null,null,null,null,null,null,null,"1",null,null,null,null,null,null,null,null,null,null,null,null,null,null,null,{"$f":"IF(OR(D2=\"Public Domain\",D2=\"Fair Use\",D2=\"Orphan Work\",D2=\"Editor/Author's Own Content\",D2=\"Creative Commons License\",D2=\"Publisher Agreement\"),\"99999\", \"\")","v":""},{"$f":"IF(OR(D2=\"Public Domain\",D2=\"Fair Use\",D2=\"Orphan Work\",D2=\"Editor/Author's Own Content\",D2=\"Creative Commons License\",D2=\"Publisher Agreement\"),\"World\", \"\")","v":""},{"$f":"IF(OR(D2=\"Public Domain\",D2=\"Fair Use\",D2=\"Orphan Work\",D2=\"Editor/Author's Own Content\",D2=\"Creative Commons License\",D2=\"Publisher Agreement\"),\"Print + Ebook\", \"\")","v":""},null,{"$f":"IF(OR(D2=\"Public Domain\",D2=\"Fair Use\",D2=\"Orphan Work\",D2=\"Editor/Author's Own Content\",D2=\"Creative Commons License\",D2=\"Publisher Agreement\"),\"None\", \"\")","v":""},null,null,null,null,null,null,null,{"$f":"IF(AND(NOT('Image Log'!I7=\"Fair Use\"),ISBLANK('Image Log'!L7)), \"\",\nIF(AND(NOT('Image Log'!I7=\"Fair Use\"),NOT(ISBLANK('Image Log'!L7))),'Image Log'!L7,\"\"))","v":""},{"$f":"IF(ISBLANK('Image Log'!D7), \"\",'Image Log'!D7)","v":""},{"$f":"IF(ISBLANK('Image Log'!D7), \"\",'Image Log'!D7)","v":""},null,{"$f":"IF(ISBLANK('Image Log'!F7), \"\",'Image Log'!F7)","v":""},{"$f":"IF(ISBLANK('Image Log'!E7), \"\",'Image Log'!E7)","v":""},null,null,null,{"$f":"IF(ISBLANK('Image Log'!G7), \"\",'Image Log'!G7)","v":""},null,null,{"$f":"IF(ISBLANK('Image Log'!J7), \"\",'Image Log'!J7)","v":""}]